Reaction Details
TargetGamma-aminobutyric acid type B receptor subunit 1
LigandBDBM7882
Substrate/Competitorn/a
Ki 229±n/a nM
CommentsPDSP_970
Citation Williams, MRisley, EA Characterization of the binding of [3H]muscimol, a potent gamma-aminobutyric acid agonist, to rat brain synaptosomal membranes using a filtration assay. J Neurochem32:713-8 (1979) 
 
Gamma-aminobutyric acid type B receptor subunit 1
Name:Gamma-aminobutyric acid type B receptor subunit 1
Type:Enzyme Catalytic Domain
Mol. Mass.:111548.69
Organism:Rattus norvegicus (Rat)
Description:Q9Z0U4
Residue:991
BDBM7882
NameBDBM7882
Synonyms:1H-imidazole Imidazole (Im) US9144538, Imidazole | imidazole
TypeSmall organic molecule
Emp. Form.C3H4N2
Mol. Mass.68.0773
SMILESc1c[nH]cn1