Reaction Details
TargetGamma-aminobutyric acid type B receptor subunit 1
LigandBDBM81478
Substrate/Competitorn/a
Ki 51±n/a nM
CommentsPDSP_1790
Citation Williams, MRisley, EA Characterization of the binding of [3H]muscimol, a potent gamma-aminobutyric acid agonist, to rat brain synaptosomal membranes using a filtration assay. J Neurochem32:713-8 (1979) 
 
Gamma-aminobutyric acid type B receptor subunit 1
Name:Gamma-aminobutyric acid type B receptor subunit 1
Type:Enzyme Catalytic Domain
Mol. Mass.:111548.69
Organism:Rattus norvegicus (Rat)
Description:Q9Z0U4
Residue:991
BDBM81478
NameBDBM81478
Synonyms:CAS_37539-03-0 | TACA
TypeSmall organic molecule
Emp. Form.C10H11N5O3S2
Mol. Mass.313.356
SMILESN[C@H]1[C@H]2SCC(CSc3cnn[nH]3)=C(N2C1=O)C(O)=O