Reaction Details
TargetGamma-aminobutyric acid type B receptor subunit 1
LigandBDBM81480
Substrate/Competitorn/a
Ki 15.5±n/a nM
CommentsPDSP_2667
Citation Herschel, MBaldessarini, RJ Evidence for two types of binding of 3H-gaba and 3H-muscimol in rat cerebral cortex and cerebellum. Life Sci24:1849-54 (1979) 
 
Gamma-aminobutyric acid type B receptor subunit 1
Name:Gamma-aminobutyric acid type B receptor subunit 1
Type:Enzyme Catalytic Domain
Mol. Mass.:111548.69
Organism:Rattus norvegicus (Rat)
Description:Q9Z0U4
Residue:991
BDBM81480
NameBDBM81480
Synonyms:CAS_118-96-7 NSC_5590 Triton,(-)
TypeSmall organic molecule
Emp. Form.C16H26O2
Mol. Mass.250.3764
SMILESCC(C)(C)CC(C)(C)c1ccc(OCCO)cc1