Reaction Details
TargetD(1A) dopamine receptor
LigandBDBM50010859
Substrate/Competitorn/a
Ki>10000±n/a nM
CommentsPDSP_973
Citation Burt, DRCreese, ISnyder, SH Properties of [3H]haloperidol and [3H]dopamine binding associated with dopamine receptors in calf brain membranes. Mol Pharmacol12:800-12 (1976) D(1A) dopamine receptor
Name:D(1A) dopamine receptor
Type:Enzyme Catalytic Domain
Mol. Mass.:49330.65
Organism:BOVINE
Description:DOPAMINE D1 DRD1 BOVINE::Q95136
Residue:446
BDBM50010859
NameBDBM50010859
Synonyms:CHEMBL11 IMIPRAMINE PAMOATE | Imipramin
TypeSmall organic molecule
Emp. Form.C19H24N2
Mol. Mass.280.4073
SMILESCN(C)CCCN1c2ccccc2CCc2ccccc12