Reaction Details
TargetD(1A) dopamine receptor
LigandBDBM78576
Substrate/Competitorn/a
Ki>10000±n/a nM
CommentsPDSP_1903
Citation Burt, DRCreese, ISnyder, SH Properties of [3H]haloperidol and [3H]dopamine binding associated with dopamine receptors in calf brain membranes. Mol Pharmacol12:800-12 (1976) D(1A) dopamine receptor
Name:D(1A) dopamine receptor
Type:Enzyme Catalytic Domain
Mol. Mass.:49330.65
Organism:BOVINE
Description:DOPAMINE D1 DRD1 BOVINE::Q95136
Residue:446
BDBM78576
NameBDBM78576
Synonyms:CIS-THIOTHIXENE SMR000058396 cid_941651 | med.21724, Compound Thiothixene
TypeSmall organic molecule
Emp. Form.C23H29N3O2S2
Mol. Mass.443.625
SMILESCN(C)S(=O)(=O)c1ccc2Sc3ccccc3\C(=C\CCN3CCN(C)CC3)c2c1