Reaction Details
TargetMuscarinic acetylcholine receptor M2
LigandBDBM46858
Substrate/Competitorn/a
Ki 5270±n/a nM
CommentsPDSP_328
Citation Wei, HBRoeske, WRLai, JWanibuchi, FHidaka, KUsuda, SYamamura, HI Pharmacological characterization of a novel muscarinic partial agonist, YM796, in transfected cells expressing the m1 or m2 muscarinic receptor gene. Life Sci50:355-63 (1992) 
 
Muscarinic acetylcholine receptor M2
Name:Muscarinic acetylcholine receptor M2
Type:Enzyme Catalytic Domain
Mol. Mass.:51555.53
Organism:RAT
Description:P10980
Residue:466
BDBM46858
NameBDBM46858
Synonyms:1-methyl-3,6-dihydro-2H-pyridine-5-carboxylic acid methyl ester;hydrobromide ARECOLINE HYDROBROMIDE SMR000058258 cid_9301 | methyl 1-methyl-3,6-dihydro-2H-pyridine-5-carboxylate;hydrobromide
TypeSmall organic molecule
Emp. Form.C8H13NO2
Mol. Mass.155.1943
SMILESCOC(=O)C1=CCCN(C)C1