Reaction Details
TargetEndochitinase A1
LigandBDBM81503
Substrate/Competitorn/a
Meas. Tech.Enzyme Inhibition Assay
pH5.5±0
Temperature310.15±0 K
IC50 4.2e+4± 1.3e+3 nM
Citation Rush, CLSchüttelkopf, AWHurtado-Guerrero, RBlair, DEIbrahim, AFDesvergnes, SEggleston, IMvan Aalten, DM Natural product-guided discovery of a fungal chitinase inhibitor. Chem Biol17:1275-81 (2010) 
 
Endochitinase A1
Name:Endochitinase A1
Type:Enzyme
Mol. Mass.:83057.83
Organism:Neosartorya fumigata (Aspergillus fumigatus)
Description:Q873Y0
Residue:825
BDBM81503
NameBDBM81503
Synonyms:Argifin-Derived Fragments, 5
TypeSmall organic molecule
Emp. Form.C9H18N4O
Mol. Mass.198.2654
SMILESCNC(=O)NC(N)=NC1CCCCC1