Reaction Details
TargetLeukotriene B4 receptor 2
LigandBDBM81520
Substrate/Competitorn/a
Ki 124±n/a nM
CommentsPDSP_494
Citation Jackson, RHMorrissey, MMSills, MAJarvis, MF Comparison of antagonist and agonist binding to the leukotriene B4 receptor intact human polymorphonuclear neutrophils (PMN). J Pharmacol Exp Ther262:80-9 (1992) Leukotriene B4 receptor 2
Name:Leukotriene B4 receptor 2
Type:Enzyme Catalytic Domain
Mol. Mass.:37964.86
Organism:Homo sapiens (Human)
Description:Leukotriene 2 0 HUMAN::Q9NPC1
Residue:358
BDBM81520
NameBDBM81520
Synonyms:CGS 23113
TypeSmall organic molecule
Emp. Form.C22H35NO3
Mol. Mass.361.5182
SMILESCCCCCCCCC(O)\C=C\c1cccc(n1)C1OC1CCCCO