Reaction Details
TargetLeukotriene B4 receptor 2
LigandBDBM50001611
Substrate/Competitorn/a
Ki 35±n/a nM
CommentsPDSP_497
Citation Jackson, RHMorrissey, MMSills, MAJarvis, MF Comparison of antagonist and agonist binding to the leukotriene B4 receptor intact human polymorphonuclear neutrophils (PMN). J Pharmacol Exp Ther262:80-9 (1992) Leukotriene B4 receptor 2
Name:Leukotriene B4 receptor 2
Type:Enzyme Catalytic Domain
Mol. Mass.:37964.86
Organism:Homo sapiens (Human)
Description:Leukotriene 2 0 HUMAN::Q9NPC1
Residue:358
BDBM50001611
NameBDBM50001611
Synonyms:(E)-3-{3-(2-Carboxy-ethyl)-4-[6-(4-methoxy-phenyl)-hex-5-enyloxy]-benzoyl}-benzoic acid 3-{3-(2-Carboxy-ethyl)-4-[(E)-6-(4-methoxy-phenyl)-hex-5-enyloxy]-benzoyl}-benzoic acid 3-{3-(2-Carboxy-ethyl)-4-[6-(4-methoxy-phenyl)-hex-5-enyloxy]-benzoyl}-benzoic acid (BT223982) CHEMBL49302 | LY-223982
TypeSmall organic molecule
Emp. Form.C30H30O7
Mol. Mass.502.555
SMILESCOc1ccc(\C=C\CCCCOc2ccc(cc2CCC(O)=O)C(=O)c2cccc(c2)C(O)=O)cc1