Reaction Details
TargetLeukotriene B4 receptor 2
LigandBDBM81519
Substrate/Competitorn/a
Ki 66±n/a nM
CommentsPDSP_499
Citation Jackson, RHMorrissey, MMSills, MAJarvis, MF Comparison of antagonist and agonist binding to the leukotriene B4 receptor intact human polymorphonuclear neutrophils (PMN). J Pharmacol Exp Ther262:80-9 (1992) Leukotriene B4 receptor 2
Name:Leukotriene B4 receptor 2
Type:Enzyme Catalytic Domain
Mol. Mass.:37964.86
Organism:Homo sapiens (Human)
Description:Leukotriene 2 0 HUMAN::Q9NPC1
Residue:358
BDBM81519
NameBDBM81519
Synonyms:CAS_117690-79-6 CHEMBL15766 | LY 255283
TypeSmall organic molecule
Emp. Form.C19H28N4O3
Mol. Mass.360.4506
SMILESCCc1cc(C(C)=O)c(O)cc1OCCCCCC(C)(C)c1nnn[nH]1