Reaction Details
TargetLeukotriene B4 receptor 2
LigandBDBM50013889
Substrate/Competitorn/a
Ki 2±n/a nM
CommentsPDSP_1103
Citation Jackson, RHMorrissey, MMSills, MAJarvis, MF Comparison of antagonist and agonist binding to the leukotriene B4 receptor intact human polymorphonuclear neutrophils (PMN). J Pharmacol Exp Ther262:80-9 (1992) Leukotriene B4 receptor 2
Name:Leukotriene B4 receptor 2
Type:Enzyme Catalytic Domain
Mol. Mass.:37964.86
Organism:Homo sapiens (Human)
Description:Leukotriene 2 0 HUMAN::Q9NPC1
Residue:358
BDBM50013889
NameBDBM50013889
Synonyms:(5S,6Z,8E,10E,12R,14Z)-5,12-dihydroxyicosa-6,8,10,14-tetraenoic acid 5,12-Dihete 5S,12R-dihydroxy-6Z,8E,10E,14Z-eicosatetraenoic acid DIHETE 12(s), 5(s) leukotriene B4
TypeSmall organic molecule
Emp. Form.C20H32O4
Mol. Mass.336.4657
SMILESCCCCC\C=C/C[C@@H](O)\C=C\C=C\C=C/[C@@H](O)CCCC(O)=O