Reaction Details
TargetHistamine H2 receptor
LigandBDBM81541
Substrate/Competitorn/a
Ki 0.2±n/a nM
CommentsPDSP_1677
Citation Hill, SJ Multiple histamine receptors: properties and functional characteristics. Biochem Soc Trans20:122-5 (1992) 
 
Histamine H2 receptor
Name:Histamine H2 receptor
Type:G Protein-Coupled Receptor (GPCR)
Mol. Mass.:40567.22
Organism:Cavia porcellus (domestic guinea pig)
Description:For the H2 receptor-binding assays, guinea pig striatum was used.
Residue:359
BDBM81541
NameBDBM81541
Synonyms:CAS_195530 S-Beta-Dimethylhistamine-R-alpha
TypeSmall organic molecule
Emp. Form.C7H13N3
Mol. Mass.139.1982
SMILESCC(N)C(C)c1cnc[nH]1