Reaction Details
TargetDNA topoisomerase 2-alpha
LigandBDBM81544
Substrate/Competitorn/a
Meas. Tech.Inhibition Assay
pH7.5±0
Temperature277.15±0 K
IC50 2.8e+3±n/a nM
Citation Kawatani, MTakayama, HMuroi, MKimura, SMaekawa, TOsada, H Identification of a small-molecule inhibitor of DNA topoisomerase II by proteomic profiling. Chem Biol18:743-51 (2011) 
 
DNA topoisomerase 2-alpha
Name:DNA topoisomerase 2-alpha
Type:Protein
Mol. Mass.:174415.30
Organism:Homo sapiens (Human)
Description:P11388
Residue:1531
BDBM81544
NameBDBM81544
Synonyms:BNS-22
TypeSmall organic molecule
Emp. Form.C24H25NO5
Mol. Mass.407.459
SMILESCCCc1cc(=O)oc2c(C(=O)N3CCCc4ccccc34)c(OC)cc(OC)c12