Reaction Details
TargetDNA topoisomerase 2-alpha
LigandBDBM81549
Substrate/Competitorn/a
Meas. Tech.Inhibition Assay
pH7.5±0
Temperature277.15±0 K
IC50 8.2e+3±n/a nM
Citation Kawatani, MTakayama, HMuroi, MKimura, SMaekawa, TOsada, H Identification of a small-molecule inhibitor of DNA topoisomerase II by proteomic profiling. Chem Biol18:743-51 (2011) 
 
DNA topoisomerase 2-alpha
Name:DNA topoisomerase 2-alpha
Type:Protein
Mol. Mass.:174415.30
Organism:Homo sapiens (Human)
Description:P11388
Residue:1531
BDBM81549
NameBDBM81549
Synonyms:BNS-65
TypeSmall organic molecule
Emp. Form.C24H23NO7
Mol. Mass.437.4419
SMILESCOC(=O)Cc1cc(=O)oc2c(C(=O)N3CCCc4ccccc34)c(OC)cc(OC)c12