Reaction Details
TargetCannabinoid receptor 2
LigandBDBM81564
Substrate/Competitorn/a
Meas. Tech.Binding Assay
Ki 40±3 nM
Citation Schuehly, WParedes, JMKleyer, JHuefner, AAnavi-Goffer, SRaduner, SAltmann, KHGertsch, J Mechanisms of Osteoclastogenesis Inhibition by a Novel Class of Biphenyl-Type Cannabinoid CB(2) Receptor Inverse Agonists. Chem Biol18:1053-64 (2011) 
 
Cannabinoid receptor 2
Name:Cannabinoid receptor 2
Type:G Protein-Coupled Receptor (GPCR)
Mol. Mass.:39690.94
Organism:Homo sapiens (Human)
Description:P34972
Residue:360
BDBM81564
NameBDBM81564
Synonyms:Magreth-16b
TypeSmall organic molecule
Emp. Form.C20H22O2
Mol. Mass.294.3875
SMILESCCOc1ccc(cc1CC=C)-c1cc(CC=C)ccc1O