Reaction Details
TargetCannabinoid receptor 2
LigandBDBM81565
Substrate/Competitorn/a
Meas. Tech.Binding Assay
Ki 57±2 nM
Citation Schuehly, WParedes, JMKleyer, JHuefner, AAnavi-Goffer, SRaduner, SAltmann, KHGertsch, J Mechanisms of Osteoclastogenesis Inhibition by a Novel Class of Biphenyl-Type Cannabinoid CB(2) Receptor Inverse Agonists. Chem Biol18:1053-64 (2011) 
 
Cannabinoid receptor 2
Name:Cannabinoid receptor 2
Type:G Protein-Coupled Receptor (GPCR)
Mol. Mass.:39690.94
Organism:Homo sapiens (Human)
Description:P34972
Residue:360
BDBM81565
NameBDBM81565
Synonyms:Magreth-17a
TypeSmall organic molecule
Emp. Form.C21H24O2
Mol. Mass.308.4141
SMILESCCCOc1ccc(CC=C)cc1-c1ccc(O)c(CC=C)c1