Reaction Details
TargetCannabinoid receptor 1
LigandBDBM81561
Substrate/Competitorn/a
Meas. Tech.Binding Assay
Ki>5000±0 nM
Citation Schuehly, WParedes, JMKleyer, JHuefner, AAnavi-Goffer, SRaduner, SAltmann, KHGertsch, J Mechanisms of Osteoclastogenesis Inhibition by a Novel Class of Biphenyl-Type Cannabinoid CB(2) Receptor Inverse Agonists. Chem Biol18:1053-64 (2011) 
 
Cannabinoid receptor 1
Name:Cannabinoid receptor 1
Type:G Protein-Coupled Receptor (GPCR)
Mol. Mass.:52868.96
Organism:Homo sapiens (Human)
Description:P21554
Residue:472
BDBM81561
NameBDBM81561
Synonyms:Magreth-12a
TypeSmall organic molecule
Emp. Form.C18H19BrO2
Mol. Mass.347.246
SMILESCC(Br)Cc1ccc(O)c(c1)-c1ccc(O)c(CC=C)c1