Reaction Details
TargetMuscarinic acetylcholine receptor M1
LigandBDBM86698
Substrate/Competitorn/a
Ki 0.231±n/a nM
CommentsPDSP_347
Citation Bolden, CCusack, BRichelson, E Antagonism by antimuscarinic and neuroleptic compounds at the five cloned human muscarinic cholinergic receptors expressed in Chinese hamster ovary cells. J Pharmacol Exp Ther260:576-80 (1992) Muscarinic acetylcholine receptor M1
Name:Muscarinic acetylcholine receptor M1
Type:Protein
Mol. Mass.:51442.54
Organism:Homo sapiens (Human)
Description:P11229
Residue:460
BDBM86698
NameBDBM86698
Synonyms:BENZTROPINE CHEMBL116590 | NSC_2344
TypeSmall organic molecule
Emp. Form.C21H25NO
Mol. Mass.307.4293
SMILESCN1C2CCC1CC(C2)OC(c1ccccc1)c1ccccc1