Reaction Details
TargetMuscarinic acetylcholine receptor M1
LigandBDBM50130257
Substrate/Competitorn/a
Ki 11±n/a nM
CommentsPDSP_515
Citation Bolden, CCusack, BRichelson, E Antagonism by antimuscarinic and neuroleptic compounds at the five cloned human muscarinic cholinergic receptors expressed in Chinese hamster ovary cells. J Pharmacol Exp Ther260:576-80 (1992) Muscarinic acetylcholine receptor M1
Name:Muscarinic acetylcholine receptor M1
Type:Protein
Mol. Mass.:51442.54
Organism:Homo sapiens (Human)
Description:P11229
Residue:460
BDBM50130257
NameBDBM50130257
Synonyms:(3E)-3-(2-chloro-9H-thioxanthen-9-ylidene)-N,N-dimethylpropan-1-amine CHEMBL90125 Chlorprothixene (cis)
TypeSmall organic molecule
Emp. Form.C18H18ClNS
Mol. Mass.315.86
SMILESCN(C)CC\C=C1/c2ccccc2Sc2ccc(Cl)cc12