Reaction Details
TargetMuscarinic acetylcholine receptor M2
LigandBDBM81484
Substrate/Competitorn/a
Ki 1800±n/a nM
CommentsPDSP_428
Citation Bolden, CCusack, BRichelson, E Antagonism by antimuscarinic and neuroleptic compounds at the five cloned human muscarinic cholinergic receptors expressed in Chinese hamster ovary cells. J Pharmacol Exp Ther260:576-80 (1992) Muscarinic acetylcholine receptor M2
Name:Muscarinic acetylcholine receptor M2
Type:GPCR
Mol. Mass.:51730.61
Organism:Homo sapiens (Human)
Description:P08172
Residue:466
BDBM81484
NameBDBM81484
Synonyms:BROMPERIDOL CAS_2448 | NSC_2448
TypeSmall organic molecule
Emp. Form.C21H23BrFNO2
Mol. Mass.420.315
SMILESOC1(CCN(CCCC(=O)c2ccc(F)cc2)CC1)c1ccc(Br)cc1