Reaction Details
TargetMuscarinic acetylcholine receptor M2
LigandBDBM81770
Substrate/Competitorn/a
Ki 62±n/a nM
CommentsPDSP_1797
Citation Bolden, CCusack, BRichelson, E Antagonism by antimuscarinic and neuroleptic compounds at the five cloned human muscarinic cholinergic receptors expressed in Chinese hamster ovary cells. J Pharmacol Exp Ther260:576-80 (1992) Muscarinic acetylcholine receptor M2
Name:Muscarinic acetylcholine receptor M2
Type:GPCR
Mol. Mass.:51730.61
Organism:Homo sapiens (Human)
Description:P08172
Residue:466
BDBM81770
NameBDBM81770
Synonyms:CAS_82650-83-7 TENILAPINE
TypeSmall organic molecule
Emp. Form.C17H16N4S2
Mol. Mass.340.466
SMILESCN1CCN(CC1)C1=Nc2cscc2C(=CC#N)c2cscc12