Reaction Details
TargetMuscarinic acetylcholine receptor M2
LigandBDBM50007692
Substrate/Competitorn/a
Ki 180±n/a nM
CommentsPDSP_1858
Citation Bolden, CCusack, BRichelson, E Antagonism by antimuscarinic and neuroleptic compounds at the five cloned human muscarinic cholinergic receptors expressed in Chinese hamster ovary cells. J Pharmacol Exp Ther260:576-80 (1992) Muscarinic acetylcholine receptor M2
Name:Muscarinic acetylcholine receptor M2
Type:GPCR
Mol. Mass.:51730.61
Organism:Homo sapiens (Human)
Description:P08172
Residue:466
BDBM50007692
NameBDBM50007692
Synonyms:8-[4-(4-Benzo[d]isothiazol-3-yl-piperazin-1-yl)-butyl]-8-aza-spiro[4.5]decane-7,9-dione CHEMBL35057 | TIOSPERONE
TypeSmall organic molecule
Emp. Form.C24H32N4O2S
Mol. Mass.440.601
SMILESO=C1CC2(CCCC2)CC(=O)N1CCCCN1CCN(CC1)c1nsc2ccccc12