Reaction Details
TargetMuscarinic acetylcholine receptor M4
LigandBDBM50062598
Substrate/Competitorn/a
Ki 7±n/a nM
CommentsPDSP_2045
Citation Bolden, CCusack, BRichelson, E Antagonism by antimuscarinic and neuroleptic compounds at the five cloned human muscarinic cholinergic receptors expressed in Chinese hamster ovary cells. J Pharmacol Exp Ther260:576-80 (1992) Muscarinic acetylcholine receptor M4
Name:Muscarinic acetylcholine receptor M4
Type:Enzyme Catalytic Domain
Mol. Mass.:53079.31
Organism:Homo sapiens (Human)
Description:Cholinergic, muscarinic M4 CHRM4 HUMAN M3::P08173
Residue:479
BDBM50062598
NameBDBM50062598
Synonyms:1-Cyclohexyl-1-phenyl-3-pyrrolidin-1-yl-propan-1-ol KEMADRIN | PROCYCLIDINE
TypeSmall organic molecule
Emp. Form.C19H29NO
Mol. Mass.287.4397
SMILESOC(CCN1CCCC1)(C1CCCCC1)c1ccccc1