Reaction Details
TargetMuscarinic acetylcholine receptor M5
LigandBDBM81768
Substrate/Competitorn/a
Ki 0.043±n/a nM
CommentsPDSP_2042
Citation Bolden, CCusack, BRichelson, E Antagonism by antimuscarinic and neuroleptic compounds at the five cloned human muscarinic cholinergic receptors expressed in Chinese hamster ovary cells. J Pharmacol Exp Ther260:576-80 (1992) Muscarinic acetylcholine receptor M5
Name:Muscarinic acetylcholine receptor M5
Type:PROTEIN
Mol. Mass.:60102.35
Organism:Homo sapiens (Human)
Description:ChEMBL_1517990
Residue:532
BDBM81768
NameBDBM81768
Synonyms:BENZYLIC ACID NSC_5311391 | Quinuclidinyl benzilate
TypeSmall organic molecule
Emp. Form.C14H12O3
Mol. Mass.228.2433
SMILESOC(=O)C(O)(c1ccccc1)c1ccccc1