Reaction Details
Target5-hydroxytryptamine receptor 2A
LigandBDBM78576
Substrate/Competitorn/a
Ki 50±n/a nM
CommentsPDSP_1850
Citation Roth, BLCiaranello, RDMeltzer, HY Binding of typical and atypical antipsychotic agents to transiently expressed 5-HT1C receptors. J Pharmacol Exp Ther260:1361-5 (1992) 5-hydroxytryptamine receptor 2A
Name:5-hydroxytryptamine receptor 2A
Type:G Protein-Coupled Receptor (GPCR)
Mol. Mass.:52852.05
Organism:Rattus norvegicus (rat)
Description:Rat cortex membranes 5-HT2A receptors.
Residue:471
BDBM78576
NameBDBM78576
Synonyms:CIS-THIOTHIXENE SMR000058396 cid_941651 | med.21724, Compound Thiothixene
TypeSmall organic molecule
Emp. Form.C23H29N3O2S2
Mol. Mass.443.625
SMILESCN(C)S(=O)(=O)c1ccc2Sc3ccccc3\C(=C\CCN3CCN(C)CC3)c2c1