Reaction Details
Target5-hydroxytryptamine receptor 2A
LigandBDBM50007692
Substrate/Competitorn/a
Ki 0.06±n/a nM
CommentsPDSP_1858
Citation Roth, BLCiaranello, RDMeltzer, HY Binding of typical and atypical antipsychotic agents to transiently expressed 5-HT1C receptors. J Pharmacol Exp Ther260:1361-5 (1992) 5-hydroxytryptamine receptor 2A
Name:5-hydroxytryptamine receptor 2A
Type:G Protein-Coupled Receptor (GPCR)
Mol. Mass.:52852.05
Organism:Rattus norvegicus (rat)
Description:Rat cortex membranes 5-HT2A receptors.
Residue:471
BDBM50007692
NameBDBM50007692
Synonyms:8-[4-(4-Benzo[d]isothiazol-3-yl-piperazin-1-yl)-butyl]-8-aza-spiro[4.5]decane-7,9-dione CHEMBL35057 | TIOSPERONE
TypeSmall organic molecule
Emp. Form.C24H32N4O2S
Mol. Mass.440.601
SMILESO=C1CC2(CCCC2)CC(=O)N1CCCCN1CCN(CC1)c1nsc2ccccc12