Reaction Details
Target5-hydroxytryptamine receptor 2C
LigandBDBM22871
Substrate/Competitorn/a
Ki 9.4±n/a nM
CommentsPDSP_1090
Citation Roth, BLCiaranello, RDMeltzer, HY Binding of typical and atypical antipsychotic agents to transiently expressed 5-HT1C receptors. J Pharmacol Exp Ther260:1361-5 (1992) 5-hydroxytryptamine receptor 2C
Name:5-hydroxytryptamine receptor 2C
Type:Enzyme
Mol. Mass.:51935.10
Organism:Rattus norvegicus (Rat)
Description:P08909
Residue:460
BDBM22871
NameBDBM22871
Synonyms:13-chloro-10-(4-methylpiperazin-1-yl)-2-oxa-9-azatricyclo[9.4.0.0^{3,8}]pentadeca-1(11),3,5,7,9,12,14-heptaene 8-chloro-6-(4-methylpiperazino)benzo[b][1,4]benzoxazepine;succinic acid CL71,563 Loxapine
TypeSmall organic molecule
Emp. Form.C18H18ClN3O
Mol. Mass.327.808
SMILESCN1CCN(CC1)C1=Nc2ccccc2Oc2ccc(Cl)cc12