Reaction Details
TargetAlpha-2B adrenergic receptor
LigandBDBM81772
Substrate/Competitorn/a
Ki 1.6±n/a nM
CommentsPDSP_327
Citation Bylund, DBBlaxall, HSIversen, LJCaron, MGLefkowitz, RJLomasney, JW Pharmacological characteristics of alpha 2-adrenergic receptors: comparison of pharmacologically defined subtypes with subtypes identified by molecular cloning. Mol Pharmacol42:1-5 (1992) Alpha-2B adrenergic receptor
Name:Alpha-2B adrenergic receptor
Type:Enzyme Catalytic Domain
Mol. Mass.:50379.83
Organism:NEONATAL RAT
Description:adrenergic Alpha2B ADRA2B NEONATAL RAT::P19328
Residue:453
BDBM81772
NameBDBM81772
Synonyms:ARC-239 NSC_122211
TypeSmall organic molecule
Emp. Form.C25H30N2O3
Mol. Mass.406.5173
SMILESCOc1ccccc1N1CCN(CCC2C(=O)c3ccccc3C(C)(C)C2=O)CC1