Reaction Details
Target5-hydroxytryptamine receptor 5A
LigandBDBM50130269
Substrate/Competitorn/a
Ki 1.99±n/a nM
CommentsPDSP_1095
Citation Plassat, JLBoschert, UAmlaiky, NHen, R The mouse 5HT5 receptor reveals a remarkable heterogeneity within the 5HT1D receptor family. EMBO J11:4779-86 (1992) 5-hydroxytryptamine receptor 5A
Name:5-hydroxytryptamine receptor 5A
Type:Enzyme Catalytic Domain
Mol. Mass.:40749.33
Organism:MOUSE
Description:5-HT5 0 MOUSE::P30966
Residue:357
BDBM50130269
NameBDBM50130269
Synonyms:(6aR,9R)-5-Bromo-7-methyl-4,6,6a,7,8,9-hexahydro-indolo[4,3-fg]quinoline-9-carboxylic acid diethylamide CHEMBL274384 | LSD,2-Bromo
TypeSmall organic molecule
Emp. Form.C20H24BrN3O
Mol. Mass.402.328
SMILESCCN(CC)C(=O)[C@H]1CN(C)[C@@H]2Cc3c(Br)[nH]c4cccc(C2=C1)c34