Reaction Details
Target5-hydroxytryptamine receptor 1B
LigandBDBM50013515
Substrate/Competitorn/a
Ki 22±n/a nM
CommentsPDSP_1987
Citation Weinshank, RLZgombick, JMMacchi, MJBranchek, TAHartig, PR Human serotonin 1D receptor is encoded by a subfamily of two distinct genes: 5-HT1D alpha and 5-HT1D beta. Proc Natl Acad Sci U S A89:3630-4 (1992) 
 
5-hydroxytryptamine receptor 1B
Name:5-hydroxytryptamine receptor 1B
Type:G Protein-Coupled Receptor (GPCR)
Mol. Mass.:43579.17
Organism:Homo sapiens (Human)
Description:Receptor binding assays were performed using human clone stably expressed in CHO cells
Residue:390
BDBM50013515
NameBDBM50013515
Synonyms:(+)-yohimbine 17alpha-hydroxyyohimban-16alpha-carboxylic acid methyl ester CORYNANTHINE Quebrachin YOHIMBINE CHLORIDE Yohimbine cid_8969 methyl 17alpha-hydroxyyohimban-16alpha-carboxylate yohimbic acid methyl ester
TypeSmall organic molecule
Emp. Form.C21H26N2O3
Mol. Mass.354.4427
SMILESCOC(=O)[C@H]1[C@@H](O)CC[C@H]2CN3CCc4c([nH]c5ccccc45)[C@@H]3C[C@H]12