Reaction Details
TargetD(2) dopamine receptor
LigandBDBM81796
Substrate/Competitorn/a
Ki 0.5±n/a nM
CommentsPDSP_981
Citation Sokoloff, PGiros, BMartres, MPAndrieux, MBesancon, RPilon, CBouthenet, MLSouil, ESchwartz, JC Localization and function of the D3 dopamine receptor. Arzneimittelforschung42:224-30 (1992) D(2) dopamine receptor
Name:D(2) dopamine receptor
Type:Cell-surface receptors
Mol. Mass.:50647.10
Organism:Homo sapiens (Human)
Description:P14416
Residue:443
BDBM81796
NameBDBM81796
Synonyms:CAS_122245 NSC_122245
TypeSmall organic molecule
Emp. Form.C19H27IN2O4S
Mol. Mass.506.398
SMILESCCS(=O)(=O)c1cc(C(=O)NCC2CCCN2CC2CC2)c(OC)cc1I