Reaction Details
Target5-hydroxytryptamine 1D receptor
LigandBDBM50056401
Substrate/Competitorn/a
Ki 2511.88±n/a nM
CommentsPDSP_1689
Citation Buchheit, KHGamse, RPfannkuche, HJ SDZ 205-557, a selective, surmountable antagonist for 5-HT4 receptors in the isolated guinea pig ileum. Naunyn Schmiedebergs Arch Pharmacol345:387-93 (1992) 
 
5-hydroxytryptamine 1D receptor
Name:5-hydroxytryptamine 1D receptor
Type:Protein
Mol. Mass.:12731.52
Organism:Bos taurus (Bovine)
Description:Q8MI13
Residue:119
BDBM50056401
NameBDBM50056401
Synonyms:2-diethylaminoethyl [2-methoxy-4-amino-5-chloro]benzoate CHEMBL287045 SDZ-205557
TypeSmall organic molecule
Emp. Form.C14H21ClN2O3
Mol. Mass.300.781
SMILESCCN(CC)CCOC(=O)c1cc(Cl)c(N)cc1OC