Reaction Details
Target5-hydroxytryptamine receptor 1D
LigandBDBM50007871
Substrate/Competitorn/a
Ki>10000±n/a nM
CommentsPDSP_956
Citation Hamblin, MWMetcalf, MA Primary structure and functional characterization of a human 5-HT1D-type serotonin receptor. Mol Pharmacol40:143-8 (1991) 5-hydroxytryptamine receptor 1D
Name:5-hydroxytryptamine receptor 1D
Type:G Protein-Coupled Receptor (GPCR)
Mol. Mass.:41920.63
Organism:Homo sapiens (Human)
Description:Receptor binding assays were performed using human clone stably expressed in CHO cells.
Residue:377
BDBM50007871
NameBDBM50007871
Synonyms:CHEMBL8197 TROPISETRON
TypeSmall organic molecule
Emp. Form.C17H20N2O2
Mol. Mass.284.3529
SMILESCN1C2CCC1CC(C2)OC(=O)c1c[nH]c2ccccc12