Reaction Details
TargetC-C chemokine receptor type 4
LigandBDBM81832
Substrate/Competitorn/a
Meas. Tech.Cell-Based Assay
IC50 3.7e+3±n/a nM
Citation Kuhn, CFBazin, MPhilippe, LZhang, JTylaska, LMiret, JBauer, PH Bipiperidinyl carboxylic acid amides as potent, selective, and functionally active CCR4 antagonists. Chem Biol Drug Des70:268-72 (2007) 
 
C-C chemokine receptor type 4
Name:C-C chemokine receptor type 4
Type:Enzyme
Mol. Mass.:41406.41
Organism:Homo sapiens (Human)
Description:P51679
Residue:360
BDBM81832
NameBDBM81832
Synonyms:Bipiperidinyl carboxylic acid amide, 6
TypeSmall organic molecule
Emp. Form.C27H43N5O2
Mol. Mass.469.6626
SMILESCc1ccccc1N1CCN(CC1)C(=O)C1CCCN(C1)C1CCN(CC1)C(=O)NC(C)(C)C