Reaction Details
TargetC-C chemokine receptor type 4
LigandBDBM81835
Substrate/Competitorn/a
Meas. Tech.Cell-Based Assay
IC50>1.0e+4±n/a nM
Citation Kuhn, CFBazin, MPhilippe, LZhang, JTylaska, LMiret, JBauer, PH Bipiperidinyl carboxylic acid amides as potent, selective, and functionally active CCR4 antagonists. Chem Biol Drug Des70:268-72 (2007) 
 
C-C chemokine receptor type 4
Name:C-C chemokine receptor type 4
Type:Enzyme
Mol. Mass.:41406.41
Organism:Homo sapiens (Human)
Description:P51679
Residue:360
BDBM81835
NameBDBM81835
Synonyms:Bipiperidinyl carboxylic acid amide, 8
TypeSmall organic molecule
Emp. Form.C25H40N6O2
Mol. Mass.456.6241
SMILESCC(C)(C)NC(=O)N1CCC(CC1)N1CCCC(C1)C(=O)N1CCN(CC1)c1ccccn1