Reaction Details
TargetC-C chemokine receptor type 4
LigandBDBM81849
Substrate/Competitorn/a
Meas. Tech.Cell-Based Assay
IC50 7.9e+3±n/a nM
Citation Kuhn, CFBazin, MPhilippe, LZhang, JTylaska, LMiret, JBauer, PH Bipiperidinyl carboxylic acid amides as potent, selective, and functionally active CCR4 antagonists. Chem Biol Drug Des70:268-72 (2007) 
 
C-C chemokine receptor type 4
Name:C-C chemokine receptor type 4
Type:Enzyme
Mol. Mass.:41406.41
Organism:Homo sapiens (Human)
Description:P51679
Residue:360
BDBM81849
NameBDBM81849
Synonyms:Bipiperidinyl carboxylic acid amide, 21
TypeSmall organic molecule
Emp. Form.C30H40N6O3
Mol. Mass.532.677
SMILESCC(=O)c1cccc(NC(=O)N2CCC(CC2)N2CCCC(C2)C(=O)N2CCN(CC2)c2cccc(C)n2)c1