Reaction Details
TargetMuscarinic acetylcholine receptor M1
LigandBDBM73209
Substrate/Competitorn/a
Ki 1.9±n/a nM
CommentsPDSP_480
Citation Mei, LLai, JYamamura, HIRoeske, WR Pharmacologic comparison of selected agonists for the M1 muscarinic receptor in transfected murine fibroblast cells (B82). J Pharmacol Exp Ther256:689-94 (1991) Muscarinic acetylcholine receptor M1
Name:Muscarinic acetylcholine receptor M1
Type:Protein
Mol. Mass.:51442.54
Organism:Homo sapiens (Human)
Description:P11229
Residue:460
BDBM73209
NameBDBM73209
Synonyms:(+)-CIS-DIOXOLANE MLS000069362 cid_657346 trimethyl-[[(2S,4R)-2-methyl-1,3-dioxolan-4-yl]methyl]ammonium;iodide | trimethyl-[[(2S,4R)-2-methyl-1,3-dioxolan-4-yl]methyl]azanium;iodide
TypeSmall organic molecule
Emp. Form.C8H18NO2
Mol. Mass.160.2335
SMILESC[C@H]1OC[C@@H](C[N+](C)(C)C)O1