Reaction Details
TargetAlpha-1A adrenergic receptor
LigandBDBM36024
Substrate/Competitorn/a
Ki 1440±n/a nM
CommentsPDSP_1482
Citation Lomasney, JWCotecchia, SLorenz, WLeung, WYSchwinn, DAYang-Feng, TLBrownstein, MLefkowitz, RJCaron, MG Molecular cloning and expression of the cDNA for the alpha 1A-adrenergic receptor. The gene for which is located on human chromosome 5. J Biol Chem266:6365-9 (1991) Alpha-1A adrenergic receptor
Name:Alpha-1A adrenergic receptor
Type:Protein
Mol. Mass.:51620.15
Organism:Rattus norvegicus (Rat)
Description:P43140
Residue:466
BDBM36024
NameBDBM36024
Synonyms:(R)-(-)-phenylephrine Phenylephrine,(-)
TypeGuest
Emp. Form.C9H14NO2
Mol. Mass.168.2124
SMILESC[NH2+]C[C@H](O)c1cccc(O)c1