Reaction Details
TargetD(1A) dopamine receptor
LigandBDBM50054062
Substrate/Competitorn/a
Ki 2172±n/a nM
CommentsPDSP_1269
Citation Sunahara, RKGuan, HCO'Dowd, BFSeeman, PLaurier, LGNg, GGeorge, SRTorchia, JVan Tol, HHNiznik, HB Cloning of the gene for a human dopamine D5 receptor with higher affinity for dopamine than D1. Nature350:614-9 (1991) 
 
D(1A) dopamine receptor
Name:D(1A) dopamine receptor
Type:Enzyme
Mol. Mass.:49303.43
Organism:Homo sapiens (Human)
Description:P21728
Residue:446
BDBM50054062
NameBDBM50054062
Synonyms:6-[Propyl-(2-thiophen-2-yl-ethyl)-amino]-5,6,7,8-tetrahydro-naphthalen-1-ol N-0437
TypeSmall organic molecule
Emp. Form.C19H25NOS
Mol. Mass.315.473
SMILESCCCN(CCc1cccs1)C1CCc2c(O)cccc2C1