Reaction Details
TargetD(1B) dopamine receptor
LigandBDBM50010301
Substrate/Competitorn/a
Ki 0.4±n/a nM
CommentsPDSP_1725
Citation Sunahara, RKGuan, HCO'Dowd, BFSeeman, PLaurier, LGNg, GGeorge, SRTorchia, JVan Tol, HHNiznik, HB Cloning of the gene for a human dopamine D5 receptor with higher affinity for dopamine than D1. Nature350:614-9 (1991) 
 
D(1B) dopamine receptor
Name:D(1B) dopamine receptor
Type:Protein
Mol. Mass.:52943.41
Organism:Homo sapiens (Human)
Description:P21918
Residue:477
BDBM50010301
NameBDBM50010301
Synonyms:8-Bromo-3-methyl-5-phenyl-2,3,4,5-tetrahydro-1H-benzo[d]azepin-7-ol(SKF 83566) SKF 83566
TypeSmall organic molecule
Emp. Form.C17H18BrNO
Mol. Mass.332.235
SMILESCN1CCc2cc(Br)c(O)cc2C(C1)c1ccccc1