Reaction Details
TargetDopamine receptor D4
LigandBDBM55121
Substrate/Competitorn/a
Ki 7.5±n/a nM
CommentsPDSP_728
Citation Van Tol, HHBunzow, JRGuan, HCSunahara, RKSeeman, PNiznik, HBCivelli, O Cloning of the gene for a human dopamine D4 receptor with high affinity for the antipsychotic clozapine. Nature350:610-4 (1991) 
 
Dopamine receptor D4
Name:Dopamine receptor D4
Type:Enzyme Catalytic Domain
Mol. Mass.:43731.97
Organism:CANINE
Description:Q589Y6
Residue:421
BDBM55121
NameBDBM55121
Synonyms:3-HYDROXYTYRAMINE HYDROCHLORIDE 4-(2-aminoethyl)pyrocatechol;hydrochloride Dopamine SMR000059081 | cid_65340
TypeSmall organic molecule
Emp. Form.C8H11NO2
Mol. Mass.153.1784
SMILESNCCc1ccc(O)c(O)c1