Reaction Details
TargetDopamine receptor D4
LigandBDBM50007568
Substrate/Competitorn/a
Ki 1.5±n/a nM
CommentsPDSP_3956
Citation Van Tol, HHBunzow, JRGuan, HCSunahara, RKSeeman, PNiznik, HBCivelli, O Cloning of the gene for a human dopamine D4 receptor with high affinity for the antipsychotic clozapine. Nature350:610-4 (1991) 
 
Dopamine receptor D4
Name:Dopamine receptor D4
Type:Enzyme Catalytic Domain
Mol. Mass.:43731.97
Organism:CANINE
Description:Q589Y6
Residue:421
BDBM50007568
NameBDBM50007568
Synonyms:1-((S)-8-Chloro-10,11-dihydro-dibenzo[b,f]thiepin-10-yl)-4-methyl-piperazine CHEMBL303313 | OCTOCLOTHEPIN-S
TypeSmall organic molecule
Emp. Form.C19H21ClN2S
Mol. Mass.344.901
SMILESCN1CCN(CC1)[C@H]1Cc2ccccc2Sc2ccc(Cl)cc12