Reaction Details
TargetDopamine receptor D4
LigandBDBM84637
Substrate/Competitorn/a
Ki 4.8±n/a nM
CommentsPDSP_1576
Citation Van Tol, HHBunzow, JRGuan, HCSunahara, RKSeeman, PNiznik, HBCivelli, O Cloning of the gene for a human dopamine D4 receptor with high affinity for the antipsychotic clozapine. Nature350:610-4 (1991) 
 
Dopamine receptor D4
Name:Dopamine receptor D4
Type:Enzyme Catalytic Domain
Mol. Mass.:43731.97
Organism:CANINE
Description:Q589Y6
Residue:421
BDBM84637
NameBDBM84637
Synonyms:CAS_85760-74-3 NSC_54562 Quinpirole,(-) | US9359372, Quinpirole
TypeSmall organic molecule
Emp. Form.C13H21N3
Mol. Mass.219.3259
SMILESCCCN1CCC[C@@H]2Cc3[nH]ncc3C[C@@H]12