Reaction Details
TargetGamma-aminobutyric acid type B receptor subunit 1
LigandBDBM50001728
Substrate/Competitorn/a
Ki 4.5±n/a nM
CommentsPDSP_275
Citation Massotti, MSchlichting, JLAntonacci, MDGiusti, PMemo, MCosta, EGuidotti, A gamma-Aminobutyric acidA receptor heterogeneity in rat central nervous system: studies with clonazepam and other benzodiazepine ligands. J Pharmacol Exp Ther256:1154-60 (1991) Gamma-aminobutyric acid type B receptor subunit 1
Name:Gamma-aminobutyric acid type B receptor subunit 1
Type:Enzyme Catalytic Domain
Mol. Mass.:111548.69
Organism:Rattus norvegicus (Rat)
Description:Q9Z0U4
Residue:991
BDBM50001728
NameBDBM50001728
Synonyms:8-Chloro-1-methyl-6-phenyl-4H-s-triazolo(4,3-a)(1,4)benzodiazepine ALPRAZOLAM Xanax
TypeSmall organic molecule
Emp. Form.C17H13ClN4
Mol. Mass.308.765
SMILESCc1nnc2CN=C(c3ccccc3)c3cc(Cl)ccc3-n12