Reaction Details
TargetGamma-aminobutyric acid type B receptor subunit 1
LigandBDBM25878
Substrate/Competitorn/a
Ki 5±n/a nM
CommentsPDSP_828
Citation Massotti, MSchlichting, JLAntonacci, MDGiusti, PMemo, MCosta, EGuidotti, A gamma-Aminobutyric acidA receptor heterogeneity in rat central nervous system: studies with clonazepam and other benzodiazepine ligands. J Pharmacol Exp Ther256:1154-60 (1991) Gamma-aminobutyric acid type B receptor subunit 1
Name:Gamma-aminobutyric acid type B receptor subunit 1
Type:Enzyme Catalytic Domain
Mol. Mass.:111548.69
Organism:Rattus norvegicus (Rat)
Description:Q9Z0U4
Residue:991
BDBM25878
NameBDBM25878
Synonyms:5-(2-fluorophenyl)-1-methyl-7-nitro-2,3-dihydro-1H-1,4-benzodiazepin-2-one Flunitrazepam [3H]flunitrazepam
Typeradiolabeled ligand
Emp. Form.C16H12FN3O3
Mol. Mass.313.2832
SMILESCN1c2ccc(cc2C(=NCC1=O)c1ccccc1F)[N+]([O-])=O