Reaction Details
TargetGamma-aminobutyric acid type B receptor subunit 1
LigandBDBM26266
Substrate/Competitorn/a
Ki 110±n/a nM
CommentsPDSP_2001
Citation Massotti, MSchlichting, JLAntonacci, MDGiusti, PMemo, MCosta, EGuidotti, A gamma-Aminobutyric acidA receptor heterogeneity in rat central nervous system: studies with clonazepam and other benzodiazepine ligands. J Pharmacol Exp Ther256:1154-60 (1991) Gamma-aminobutyric acid type B receptor subunit 1
Name:Gamma-aminobutyric acid type B receptor subunit 1
Type:Enzyme Catalytic Domain
Mol. Mass.:111548.69
Organism:Rattus norvegicus (Rat)
Description:Q9Z0U4
Residue:991
BDBM26266
NameBDBM26266
Synonyms:Ambien Dalparan ZPM Zolpidem tartrate
TypeSmall organic molecule
Emp. Form.C19H21N3O
Mol. Mass.307.3895
SMILESCN(C)C(=O)Cc1c(nc2ccc(C)cn12)-c1ccc(C)cc1