Reaction Details
Target5-hydroxytryptamine 1D receptor
LigandBDBM50014247
Substrate/Competitorn/a
Ki 3715.35±n/a nM
CommentsPDSP_811
Citation Wong, DTThrelkeld, PGRobertson, DW Affinities of fluoxetine, its enantiomers, and other inhibitors of serotonin uptake for subtypes of serotonin receptors. Neuropsychopharmacology5:43-7 (1991) 5-hydroxytryptamine 1D receptor
Name:5-hydroxytryptamine 1D receptor
Type:Protein
Mol. Mass.:12731.52
Organism:Bos taurus (Bovine)
Description:Q8MI13
Residue:119
BDBM50014247
NameBDBM50014247
Synonyms:(3R,4S)-3-(4-Methoxy-phenoxymethyl)-1-methyl-4-phenyl-piperidine CHEMBL94739 | Femoxetine
TypeSmall organic molecule
Emp. Form.C20H25NO2
Mol. Mass.311.418
SMILESCOc1ccc(OC[C@H]2CN(C)CC[C@@H]2c2ccccc2)cc1