Reaction Details
Target5-hydroxytryptamine receptor 1B
LigandBDBM81886
Substrate/Competitorn/a
Ki 56.23±n/a nM
CommentsPDSP_6652
Citation Tsuchihashi, HNakashima, YKinami, JNagatomo, T Characteristics of 125I-iodocyanopindolol binding to beta-adrenergic and serotonin-1B receptors of rat brain: selectivity of beta-adrenergic agents. Jpn J Pharmacol52:195-200 (1990) 
 
5-hydroxytryptamine receptor 1B
Name:5-hydroxytryptamine receptor 1B
Type:Protein
Mol. Mass.:43173.33
Organism:Rattus norvegicus (Rat)
Description:P28564
Residue:386
BDBM81886
NameBDBM81886
Synonyms:CAS_3506-09-0 PROPRANOLOL, dl
TypeSmall organic molecule
Emp. Form.C17H23NO2
Mol. Mass.273.37
SMILESCC(C)CNCC(O)COc1cccc2ccccc12