Reaction Details
Target5-hydroxytryptamine receptor 1B
LigandBDBM81882
Substrate/Competitorn/a
Ki 1288.25±n/a nM
CommentsPDSP_6654
Citation Tsuchihashi, HNakashima, YKinami, JNagatomo, T Characteristics of 125I-iodocyanopindolol binding to beta-adrenergic and serotonin-1B receptors of rat brain: selectivity of beta-adrenergic agents. Jpn J Pharmacol52:195-200 (1990) 
 
5-hydroxytryptamine receptor 1B
Name:5-hydroxytryptamine receptor 1B
Type:Protein
Mol. Mass.:43173.33
Organism:Rattus norvegicus (Rat)
Description:P28564
Residue:386
BDBM81882
NameBDBM81882
Synonyms:CAS_93633-92-2 | YM-09538
TypeSmall organic molecule
Emp. Form.C18H24N2O5S
Mol. Mass.380.459
SMILESCOc1ccccc1OCCNCC(O)c1ccc(C)c(c1)S(N)(=O)=O