Reaction Details
TargetBeta-1 adrenergic receptor
LigandBDBM25764
Substrate/Competitorn/a
Ki 4.17±n/a nM
CommentsPDSP_276
Citation Tsuchihashi, HNakashima, YKinami, JNagatomo, T Characteristics of 125I-iodocyanopindolol binding to beta-adrenergic and serotonin-1B receptors of rat brain: selectivity of beta-adrenergic agents. Jpn J Pharmacol52:195-200 (1990) 
 
Beta-1 adrenergic receptor
Name:Beta-1 adrenergic receptor
Type:Protein
Mol. Mass.:50486.84
Organism:Rattus norvegicus (Rat)
Description:P18090
Residue:466
BDBM25764
NameBDBM25764
Synonyms:ALPRENOLOL,(+) Alfeprol Alprenolol {2-hydroxy-3-[2-(prop-2-en-1-yl)phenoxy]propyl}(propan-2-yl)amine
TypeSmall organic molecule
Emp. Form.C15H23NO2
Mol. Mass.249.3486
SMILESCC(C)NCC(O)COc1ccccc1CC=C